{"text_format":"1","workbook":"xlsx","n_sheets":21,"sheets":["Cover","Index","Basic instructions","Methodology","Metadata","Footnotes list","Table_4","Table_5","Table_6","Table_7","Quality_report","Validation rules","ErrorLog","Lists","NotStandardRules","CountryName","Summations","Mandatory","MustNotBeNegative","FootnoteContent","IsNumeric"],"not_rendered":{"charts":0,"images":8,"macros":1,"external_links":1,"defined_names":57,"comments":1,"pivot_tables":0},"unopened":[],"bounds":{"document_bytes":16777216,"sheet_cells":100000,"rows_first":2000,"rows_last":500,"rows_between":2000,"halvings":0,"cell_chars":16384,"cell_head_chars":4096},"cells_cut":0,"cells_raw":0,"read":"whole","date_system":"1900"}

{"sheet":"Cover","index":0,"n_rows":17,"n_cols":3,"rows_kept":17,"cut":false,"hidden":false,"merged":[[8,1,8,3],[18,1,23,3],[16,1,16,3],[1,1,1,3],[9,1,9,3],[10,1,11,3],[13,1,13,3]]}
[]
[null,"Statistical Office of the European Union"]
[]
[]
[]
[]
[]
[]
[]
[null,"Directorate E: Sectoral and regional statistics"]
{"$rows_left_out":8}
{"sheet":"Index","index":1,"n_rows":20,"n_cols":5,"rows_kept":20,"cut":false,"hidden":false,"merged":[[14,1,14,2],[20,3,20,4],[15,1,15,2],[16,1,16,2],[17,1,17,2],[18,1,18,4],[19,1,19,2],[2,1,2,3],[4,1,4,4],[5,1,5,4],[13,1,13,4],[9,1,9,2],[7,1,7,4],[6,1,6,2],[8,1,8,2],[10,1,10,2],[11,1,11,2],[12,1,12,2]]}
[]
[]
[]
[]
[null,"CONSUMPTION OF LIGHTWEIGHT PLASTIC CARRIER BAGS\n2020 DATA COLLECTION"]
[null,"STRUCTURE OF THE QUESTIONNAIRE"]
[null,"TITLE",null,"DESCRIPTION","TYPE"]
[null,"I. Yellow tabbed sheets in the questionnaire"]
[null,"Index",null,"Structure of the questionnaire","for information"]
[null,"Basic instructions ",null,"Basic instructions","for reading before filling in the questionnaire"]
{"$rows_left_out":11}
{"sheet":"Basic instructions","index":2,"n_rows":91,"n_cols":10,"rows_kept":91,"cut":false,"hidden":false,"merged":[[61,2,61,4],[23,3,23,15],[6,2,6,15],[68,2,68,15],[67,2,67,15],[52,2,52,15],[53,2,53,15],[62,2,62,15],[58,2,58,15],[55,2,55,15],[56,2,56,15],[65,2,65,15],[59,2,59,15],[15,3,15,15],[46,2,46,15],[41,2,41,3],[57,2,57,15],[36,2,36,15],[50,2,50,13],[49,2,49,15],[54,2,54,15],[38,2,38,15],[40,2,40,3],[43,2,43,15],[44,2,44,15],[45,2,45,15],[2,2,2,15],[3,2,3,15],[26,2,26,15],[39,2,39,3],[5,2,5,15],[28,2,28,15],[27,2,27,15],[29,2,29,15],[24,2,24,15],[8,2,8,15],[10,2,10,3],[13,2,13,15],[17,3,17,15],[19,3,19,15],[21,3,21,15],[10,6,10,8],[79,1,79,16],[75,2,75,15],[91,1,91,16],[81,1,81,16],[86,1,86,16],[87,1,87,16],[88,1,88,16],[83,1,83,16],[82,1,82,16],[89,1,89,16],[90,1,90,16],[9,2,9,15],[78,2,78,15],[85,2,85,15],[77,2,77,15],[35,2,35,15],[48,2,48,15],[51,2,51,15],[64,2,64,15],[69,2,69,15],[66,2,66,15],[70,1,70,16],[72,2,72,15],[74,2,74,15],[73,2,73,15],[80,1,80,16],[33,2,33,4],[33,5,33,11],[32,3,32,4],[30,3,30,4],[31,3,31,4],[30,5,30,11],[31,5,31,11],[32,5,32,11]]}
[]
[]
[null,null,"CONSUMPTION OF LIGHTWEIGHT PLASTIC CARRIER BAGS\n2020 DATA COLLECTION"]
[null,null,"Basic instructions"]
[]
[null,null,"Before filling in the questionnaire please read carefully the instructions below. This EXCEL workbook is the questionnaire. Please do not  delete or add rows in the questionnaire (except where instructed in the quality report tab)."]
[null,null,"Please note that this questionnaire only includes tables 4 to 7 for lightweight carrier bag reporting, as presented in Commission Implementing Decision (EU) 2018/896. Tables 1 to 3 to report packaging and packaging waste according to Commission Decision 2005/270/EC are included in a different questionnaire."]
[]
[null,null,"1. Getting started "]
[null,null,"Enter the data without changing the format of the questionnaire (i.e. do not add/delete rows or columns) since Eurostat uses automated routines for data validation."]
{"$rows_left_out":82}
{"sheet":"Methodology","index":3,"n_rows":47,"n_cols":2,"rows_kept":47,"cut":false,"hidden":false,"merged":[[46,1,46,2],[37,1,37,2],[40,1,40,2],[42,1,42,2],[44,1,44,2],[45,1,45,2],[41,1,41,2],[43,1,43,2],[16,1,16,2],[22,1,22,2],[24,1,24,2],[30,1,30,2],[38,1,38,2],[21,1,21,2],[25,1,25,2],[34,1,34,2],[23,1,23,2],[28,1,28,2],[26,1,26,2],[32,1,32,2],[35,1,35,2],[36,1,36,2],[27,1,27,2],[29,1,29,2],[15,1,15,2],[1,1,1,2],[11,1,11,2],[13,1,13,2],[12,1,12,2],[4,1,4,2],[5,1,5,2],[8,1,8,2],[7,1,7,2],[6,1,6,2],[9,1,9,2],[17,1,17,2],[18,1,18,2],[19,1,19,2],[20,1,20,2],[39,1,39,2],[31,1,31,2]]}
[]
[null,"EXPLANATORY NOTES AND METHODOLOGY"]
[]
[]
[null,"Table of contents"]
[null,"1. Background"]
[null,"2. Legal acts"]
[null,"3. Data reporting - questionnaire"]
[null,"4. Methodology for reporting by numbers"]
[null,"5. Methodology for reporting by weight "]
{"$rows_left_out":38}
{"sheet":"Metadata","index":4,"n_rows":40,"n_cols":4,"rows_kept":40,"cut":false,"hidden":false,"merged":[[13,2,13,3],[34,1,34,3],[35,2,35,3],[38,1,38,3],[20,1,20,3],[18,1,18,3],[19,2,19,3],[16,1,16,3],[14,1,14,3],[15,2,15,3],[21,2,21,3],[17,2,17,3],[39,2,39,3],[37,2,37,3],[36,1,36,3],[22,1,22,3],[23,2,23,3],[24,1,24,3],[25,2,25,3],[26,1,26,3],[28,1,28,3],[30,1,30,3],[31,2,31,3],[32,1,32,3],[27,2,27,3],[33,2,33,3],[29,2,29,3],[12,1,12,3],[9,2,9,3],[11,2,11,3],[10,1,10,3],[1,1,1,3],[2,1,2,3],[8,1,8,3],[6,1,6,3],[7,2,7,3]]}
[]
[null,"ANNUAL CONSUMPTION OF LIGHTWEIGHT PLASTIC CARRIER BAGS\nQUESTIONS ON METHODOLOGY"]
[null," 1. Please enter the name and email address of the person that filled in this questionnaire"]
[null,null,"Name:","Fabien Wahl"]
[]
[null,null,"E-mail:","fabien.wahl@aev.etat.lu"]
[null,"2. Please explain the methodology you have selected for official reporting (in numbers, in weight). State the table you filled as your primary (mandatory) reporting."]
[null,null,"Table 4 reporting the annual number of lightweight plastic carrier bags placed on the market was used for the mandatory reporting."]
[null,"3. Please describe your data source(s). Please clearly distinguish the sources used for your primary (mandatory) reporting from the sources used for completing other tables voluntarily."]
[null,null,"The annual report from Valorlux, the unique Producer Responsibility Organisation for packagings in Luxemburg which represents 92,2% of all packaging producers placing on the market (pourcentage estimated by the PRO). Valorlux has to report annually to the administration of the environment, and indicates the total number of lightweight and very lightweight plastic bags placed on the market by its members."]
{"$rows_left_out":31}
{"sheet":"Footnotes list","index":5,"n_rows":38,"n_cols":3,"rows_kept":38,"cut":false,"hidden":false,"merged":[[1,1,1,2]]}
[]
[null,"ANNUAL CONSUMPTION OF LIGHTWEIGHT PLASTIC CARRIER BAGS\nFOOTNOTES LIST"]
[null,"Country:",{"$f":"IF('Basic instructions'!G11=\"\",\"\",'Basic instructions'!G11)","v":"Luxembourg"}]
[null,"Number","Country-specific explanatory footnotes"]
[null,1,"Please enter your text here"]
[null,2]
[null,3]
[null,4]
[null,5]
[null,6]
{"$rows_left_out":29}
{"sheet":"Table_4","index":6,"n_rows":26,"n_cols":10,"rows_kept":26,"cut":false,"hidden":false,"merged":[[6,7,7,7],[6,8,7,9],[4,5,4,9],[5,5,5,9]]}
[]
[]
[]
[]
[null,null,null,null,null,"TABLE 4 - Annual consumption of lightweight plastic carrier bags calculated in accordance with the methodology laid\ndown in Art. 2 (1)(a) of Commission Implementing Decision (EU) 2018/896"]
[null,null,null,null,null,"Number of lightweight plastic carrier bags placed on the market"]
[null,null,null,null,null,{"$f":"CONCATENATE(\"COUNTRY: \",'Basic instructions'!G11)","v":"COUNTRY: Luxembourg"},{"$f":"'Basic instructions'!J11","v":"LU"},"Standard footnotes","Explanatory\nfootnote"]
["unit","waste","calcmeth",null,null,"REFERENCE YEAR:",{"$f":"'Basic instructions'!G12","v":2018}]
[]
["NR","W150102CB_LT50","PLC_MKT",null,null,"Number of lightweight plastic carrier bags placed on the market",{"$f":"G11+G12","v":67229738}," ",null,{"$f":"IF(TRIM(I10)=\"\", \"\", IF(VLOOKUP(I10,'Footnotes list'!$B$5:$C$38,2,FALSE)=0,\"\",VLOOKUP(I10,'Footnotes list'!$B$5:$C$38,2,FALSE) ) )","v":""}]
{"$rows_left_out":17}
{"sheet":"Table_5","index":7,"n_rows":30,"n_cols":10,"rows_kept":30,"cut":false,"hidden":false,"merged":[[6,7,7,7],[6,8,7,9],[4,5,4,9],[5,5,5,9]]}
[]
[]
[]
[]
[null,null,null,null,null,"TABLE 5 - Annual consumption of lightweight plastic carrier bags calculated in accordance with the methodology laid\n down in Art. 2 (1)(b) of Commission Implementing Decision (EU) 2018/896"]
[null,null,null,null,null,"Number of lightweight plastic carrier bags calculated from mandatory taxes, charges or levies"]
[null,null,null,null,null,{"$f":"CONCATENATE(\"COUNTRY: \",'Basic instructions'!G11)","v":"COUNTRY: Luxembourg"},{"$f":"'Basic instructions'!J11","v":"LU"},"Standard footnotes","Explanatory\nfootnote"]
["unit","waste","calcmeth",null,null,"REFERENCE YEAR:",{"$f":"'Basic instructions'!G12","v":2018}]
[]
["NR","W150102CB_LT50","I_TAX_CHRG_LEV",null,null,"(a) Number of lightweight plastic carrier bags calculated from mandatory taxes, charges or levies as declared or reported by economic operators",null," ",null,{"$f":"IF(TRIM(I10)=\"\", \"\", IF(VLOOKUP(I10,'Footnotes list'!$B$5:$C$38,2,FALSE)=0,\"\",VLOOKUP(I10,'Footnotes list'!$B$5:$C$38,2,FALSE) ) )","v":""}]
{"$rows_left_out":21}
{"sheet":"Table_6","index":8,"n_rows":30,"n_cols":10,"rows_kept":30,"cut":false,"hidden":false,"merged":[[6,7,7,7],[6,8,7,9],[4,5,4,9],[5,5,5,9]]}
[]
[]
[]
[]
[null,null,null,null,null,"TABLE 6 - Annual consumption of lightweight plastic carrier bags calculated in accordance with the methodology\nlaid down in Article 3(1)(a) of Commission Implementing Decision (EU) 2018/896"]
[null,null,null,null,null,"Weight of lightweight plastic carrier bags placed on the market"]
[null,null,null,null,null,{"$f":"CONCATENATE(\"COUNTRY: \",'Basic instructions'!G11)","v":"COUNTRY: Luxembourg"},{"$f":"'Basic instructions'!J11","v":"LU"},"Standard footnotes","Explanatory\nfootnote"]
["unit","waste","calcmeth",null,null,"REFERENCE YEAR:",{"$f":"'Basic instructions'!G12","v":2018}]
[]
["T","W150102CB_LT50","PLC_MKT",null,null,"Weight of lightweight plastic carrier bags placed on the market (in tonnes)",null," ",null,{"$f":"IF(TRIM(I10)=\"\", \"\", IF(VLOOKUP(I10,'Footnotes list'!$B$5:$C$38,2,FALSE)=0,\"\",VLOOKUP(I10,'Footnotes list'!$B$5:$C$38,2,FALSE) ) )","v":""}]
{"$rows_left_out":21}
{"sheet":"Table_7","index":9,"n_rows":38,"n_cols":10,"rows_kept":38,"cut":false,"hidden":false,"merged":[[6,7,7,7],[6,8,7,9],[4,5,4,9],[5,5,5,9]]}
[]
[]
[]
[]
[null,null,null,null,null,"TABLE 7 - Annual consumption of lightweight plastic carrier bags calculated in accordance with the methodology laid down in Art. 3(1)(b) of Commission Implementing Decision (EU) 2018/896"]
[null,null,null,null,null,"Weight of lightweight plastic carrier bags calculated from mandatory taxes, charges or levies"]
[null,null,null,null,null,{"$f":"CONCATENATE(\"COUNTRY: \",'Basic instructions'!G11)","v":"COUNTRY: Luxembourg"},{"$f":"'Basic instructions'!J11","v":"LU"},"Standard footnotes","Explanatory\nfootnote"]
["unit","waste","calcmeth",null,null,"REFERENCE YEAR:",{"$f":"'Basic instructions'!G12","v":2018}]
[]
["T","W150102CB_LT50","I_TAX_CHRG_LEV",null,null,"(a) Weight of lightweight plastic carrier bags calculated from mandatory taxes, charges or levies as declared or reported by economic operators (in tonnes)",null," ",null,{"$f":"IF(TRIM(I10)=\"\", \"\", IF(VLOOKUP(I10,'Footnotes list'!$B$5:$C$38,2,FALSE)=0,\"\",VLOOKUP(I10,'Footnotes list'!$B$5:$C$38,2,FALSE) ) )","v":""}]
{"$rows_left_out":29}
{"sheet":"Quality_report","index":10,"n_rows":62,"n_cols":10,"rows_kept":62,"cut":false,"hidden":false,"merged":[[7,0,7,4],[8,0,8,4],[9,0,9,4],[11,0,11,8],[21,0,21,8],[14,0,14,4],[15,0,15,4],[17,0,17,4],[18,0,18,4],[19,0,19,4],[12,5,12,9],[13,5,13,9],[12,0,12,4],[13,0,13,4],[16,0,16,4],[16,5,16,9],[0,3,0,6],[3,0,3,4],[4,0,4,4],[5,0,5,4],[6,0,6,4],[61,0,61,9],[54,0,54,9],[55,0,55,9],[60,0,60,9],[56,0,56,8],[57,0,57,9],[49,0,49,9],[50,0,50,9],[46,0,46,9],[53,0,53,9],[36,1,36,9],[37,1,37,9],[38,1,38,9],[52,0,52,8],[41,0,41,9],[39,1,39,9],[42,0,42,9],[47,0,47,9],[48,0,48,9],[40,0,40,9],[18,5,18,9],[19,5,19,9],[27,0,27,8],[14,5,14,9],[15,5,15,9],[20,0,20,9],[22,5,22,9],[23,0,23,4],[17,5,17,9],[35,1,35,9],[22,0,22,4],[28,0,28,9],[31,0,31,8],[30,0,30,9],[25,0,25,9],[26,0,26,9],[33,0,33,9],[32,0,32,9],[23,5,23,9],[34,0,34,9]]}
[null,null,null,"Annual consumption of lightweight plastic carrier bags\nQUALITY REPORT"]
[null,null," "]
[]
["Quality report"]
["1. General information"]
["2. Description of the parties involved in the data collection"]
["3. Description of methods used"]
["4. Accuracy of the data"]
["5. Confidentiality"]
["6. Main national websites, reference documents and publications"]
{"$rows_left_out":53}
{"sheet":"Validation rules","index":11,"n_rows":22,"n_cols":2,"rows_kept":22,"cut":false,"hidden":false,"merged":[]}
[null,"This sheet shows checks that Eurostat plans to implement in an automatic way - to be completed"]
["Preliminary checks:"]
[]
[null,"The reporting country name must be filled in the sheet \"Basic Instructions\"."]
[null,"The primary contact point should be filled in the sheet \"Basic instructions\""]
[]
["Mandatory Data:"]
[]
[null,"All the mandatory cells in at least one of the tables (4 to 7) must be filled-in"]
[]
{"$rows_left_out":13}
{"sheet":"ErrorLog","index":12,"n_rows":1,"n_cols":7,"rows_kept":1,"cut":false,"hidden":false,"merged":[]}
["Link to Error","Validation Rule","Cell","Sheet","Description","Severity","Former Color"]

{"sheet":"Lists","index":13,"n_rows":42,"n_cols":5,"rows_kept":42,"cut":false,"hidden":true,"merged":[]}
["Country label","Country code",null,"Valid flags","Label"]
["Belgium","BE",null,"B","break in time series"]
["Bulgaria","BG",null,"E","estimated data"]
["Czechia","CZ",null,"P","provisional"]
["Denmark","DK",null,"BE"]
["Germany","DE",null,"BP"]
["Estonia","EE",null,"EP"]
["Ireland","IE",null,"BEP"]
["Greece","EL"]
["Spain","ES"]
{"$rows_left_out":33}
{"sheet":"NotStandardRules","index":14,"n_rows":3,"n_cols":1,"rows_kept":3,"cut":false,"hidden":true,"merged":[]}
["RuleName"]
["SpecificMandatoryPBAG"]
["InBetweenPBAG"]

{"sheet":"CountryName","index":15,"n_rows":16,"n_cols":6,"rows_kept":16,"cut":false,"hidden":true,"merged":[]}
["Severity","SheetName","TopLeftCell","BottomRightCell","RowStep","ColumnStep"]
["Error","Basic instructions","G11","G11",1,1]
[]
[]
[]
["DESCRIPTION"]
["Spot the position where the reporting country is defined"]
[]
["PARAMETERS"]
[{"$f":"B1","v":"SheetName"},"Name of the sheet to be validated (e.g. Table 1)"]
{"$rows_left_out":7}
{"sheet":"Summations","index":16,"n_rows":110,"n_cols":11,"rows_kept":110,"cut":false,"hidden":true,"merged":[[11,5,11,6]]}
["Severity","Sheet Name","List of Cells\n (first block)","First Total Cell (first block)","Last Total Cell\n(Last block)","Row Block Repetition Step","Column Block Repetition Step","Greater or Equal","Valid Tolerance","Only if all data is available","Display text in error"]
["Error","Table_4","G11,G12","G10","G10",999,999,"EQ",0.1,"NO","Total must be equal to values for \"< 15\" plus \"15-50\""]
["Error","Table_5","G11,G12","G10","G13",3,999,"EQ",0.1,"NO","Total must be equal to values for \"< 15\" plus \"15-50\""]
["Error","Table_5","G10,G13","G16","G16",999,999,"EQ",0.1,"NO","Total must be equal to values for (a) + (b)"]
["Error","Table_6","G11,G12","G10","G10",999,999,"EQ",0.1,"NO","Total must be equal to values for \"< 15\" plus \"15-50\""]
["Error","Table_6","G15,G16","G14","G14",999,999,"EQ",0.1,"NO","Total must be equal to values for \"< 15\" plus \"15-50\""]
["Error","Table_7","G11,G12","G10","G13",3,999,"EQ",0.1,"NO","Total must be equal to values for \"< 15\" plus \"15-50\""]
["Error","Table_7","G10,G13","G16","G16",999,999,"EQ",0.1,"NO","Total must be equal to values for (a) + (b)"]
[]
[]
{"$rows_left_out":101}
{"sheet":"Mandatory","index":17,"n_rows":4,"n_cols":8,"rows_kept":4,"cut":false,"hidden":true,"merged":[]}
["Severity","SheetName","Top Left Cell","Bottom Right Cell","Row Step","Column Step","Empty Is Valid If Footnote Exists","Footnote Shift From Value\n(Text position)"]
["Error","Basic instructions","D16","D24",2,999,"NO",3]
[]
[null,null,null,null,null,null,"999 =","Not Applicable"]

{"sheet":"MustNotBeNegative","index":18,"n_rows":5,"n_cols":8,"rows_kept":5,"cut":false,"hidden":true,"merged":[]}
["Severity","SheetName","TopLeftCell","BottomRightCell","RowStep","ColumnStep"]
["Error","Table_4","G10","G14",1,999]
["Error","Table_5","G10","G18",1,999,null,"999 = not relevant"]
["Error","Table_6","G10","G18",1,999]
["Error","Table_7","G10","G26",1,999]

{"sheet":"FootnoteContent","index":19,"n_rows":5,"n_cols":7,"rows_kept":5,"cut":false,"hidden":true,"merged":[]}
["Severity","SheetName","TopLeftCell","BottomRightCell","RowStep","ColumnStep","DistanceFromReferenceToText"]
["Error","Table_4","I10","I14",1,999,1]
["Error","Table_5","I10","I18",1,999,1]
["Error","Table_6","I10","I18",1,999,1]
["Error","Table_7","I10","I26",1,999,1]

{"sheet":"IsNumeric","index":20,"n_rows":5,"n_cols":6,"rows_kept":5,"cut":false,"hidden":true,"merged":[]}
["Severity","SheetName","TopLeftCell","BottomRightCell","RowStep","ColumnStep"]
["Error","Table_4","G10","G14",1,999]
["Error","Table_5","G10","G18",1,999]
["Error","Table_6","G10","G18",1,999]
["Error","Table_7","G10","G26",1,999]