{"text_format":"1","workbook":"xlsx","n_sheets":29,"sheets":["COVER","Index","Basic instructions","Methodology","Metadata","Footnotes list","Table_1","Table_1a","Table_2","Table_3","ErrorLog","Lists","Locks","CountryName","Summations","Mandatory","MustNotBeNegative","Thresholds","IsFormula","FootnoteContent","IsNumeric","Validation rules","Quality_report >>>","Overview & Waste Gen.","Waste Management","Data Accuracy","Reusable & Traceability","Confidentiality & References","Any further detailed data..."],"not_rendered":{"charts":0,"images":7,"macros":1,"external_links":0,"defined_names":31,"comments":2,"pivot_tables":0},"unopened":[],"bounds":{"document_bytes":16777216,"sheet_cells":100000,"rows_first":2000,"rows_last":500,"rows_between":2000,"halvings":0,"cell_chars":16384,"cell_head_chars":4096},"cells_cut":0,"cells_raw":0,"read":"whole","date_system":"1900"}

{"sheet":"COVER","index":0,"n_rows":17,"n_cols":3,"rows_kept":17,"cut":false,"hidden":false,"merged":[[8,1,8,3],[18,1,23,3],[16,1,16,3],[1,1,1,3],[9,1,9,3],[10,1,11,3],[13,1,13,3]]}
[]
[null,"Statistical Office of the European Union"]
[]
[]
[]
[]
{"$rows_left_out":12}
{"sheet":"Index","index":1,"n_rows":20,"n_cols":5,"rows_kept":20,"cut":false,"hidden":false,"merged":[[2,1,2,3],[4,1,4,4],[5,1,5,4],[13,1,13,4],[9,1,9,2],[7,1,7,4],[6,1,6,2],[8,1,8,2],[10,1,10,2],[11,1,11,2],[12,1,12,2],[14,1,14,2],[20,3,20,4],[15,1,15,2],[16,1,16,2],[17,1,17,2],[18,1,18,4],[19,1,19,2]]}
[]
[]
[]
[]
[null,"ANNUAL REPORTING OF PACKAGING AND PACKAGING WASTE\n2020 DATA COLLECTION"]
[null,"STRUCTURE OF THE QUESTIONNAIRE"]
{"$rows_left_out":15}
{"sheet":"Basic instructions","index":2,"n_rows":81,"n_cols":10,"rows_kept":81,"cut":false,"hidden":false,"merged":[[13,2,13,15],[15,3,15,15],[17,3,17,15],[19,3,19,15],[10,6,10,8],[10,2,10,4],[29,2,29,15],[30,3,30,4],[30,5,30,11],[31,3,31,4],[31,5,31,11],[21,3,21,15],[23,3,23,15],[24,2,24,15],[26,2,26,15],[28,2,28,15],[27,2,27,15],[81,1,81,16],[71,2,71,15],[72,2,72,15],[73,2,73,15],[79,2,79,15],[80,2,80,15],[75,2,75,15],[76,2,76,15],[77,2,77,15],[78,2,78,15],[2,2,2,15],[3,2,3,15],[5,2,5,15],[53,2,53,15],[47,2,47,13],[46,2,46,15],[50,2,50,15],[40,2,40,14],[6,2,6,15],[8,2,8,15],[48,2,48,15],[49,2,49,15],[51,2,51,15],[52,2,52,15],[36,2,36,3],[37,2,37,3],[70,2,70,15],[54,2,54,15],[60,2,60,15],[67,1,67,16],[57,2,57,14],[64,2,64,15],[66,2,66,15],[65,2,65,15],[61,2,61,15],[55,2,55,15],[63,2,63,15],[62,2,62,15],[58,2,58,15],[32,5,32,11],[33,2,33,4],[33,5,33,11],[68,2,68,15],[69,2,69,15],[41,2,41,14],[42,2,42,15],[43,2,43,15],[35,2,35,15],[38,2,38,3],[32,3,32,4]]}
[]
[]
[null,null,"ANNUAL REPORTING OF PACKAGING AND PACKAGING WASTE\n2020 DATA COLLECTION"]
[null,null,"Basic instructions"]
[]
[null,null,"Before filling in the questionnaire please read carefully the instructions below. This EXCEL workbook is the questionnaire. Please do not  delete or add rows in the questionnaire (except where instructed in the quality report tab)."]
{"$rows_left_out":76}
{"sheet":"Methodology","index":3,"n_rows":19,"n_cols":2,"rows_kept":19,"cut":false,"hidden":false,"merged":[[13,1,13,2],[1,1,1,2],[9,1,9,2],[11,1,11,2],[10,1,10,2],[4,1,4,2],[5,1,5,2],[7,1,7,2],[6,1,6,2],[8,1,8,2],[14,1,14,2],[17,1,17,2],[18,1,18,2],[16,1,16,2],[15,1,15,2]]}
[]
[null,"EXPLANATORY NOTES AND METHODOLOGY"]
[]
[]
[null,"Table of contents"]
[null,"1. Background"]
{"$rows_left_out":14}
{"sheet":"Metadata","index":4,"n_rows":21,"n_cols":4,"rows_kept":21,"cut":false,"hidden":false,"merged":[[18,1,18,3],[19,2,19,3],[21,2,21,3],[20,1,20,3],[7,2,7,3],[12,1,12,3],[13,2,13,3],[10,1,10,3],[11,2,11,3],[14,1,14,3],[15,2,15,3],[16,1,16,3],[17,2,17,3],[1,1,1,3],[2,1,2,3],[6,1,6,3],[8,1,8,3],[9,2,9,3]]}
[]
[null,"ANNUAL REPORTING OF PACKAGING AND PACKAGING WASTE\nQUESTIONS ON METHODOLOGY"]
[null," 1. Please enter the name and email address of the person that filled in this questionnaire"]
[null,null,"Name:","Tim Mirgain"]
[]
[null,null,"E-mail:","tim.mirgain@aev.etat.lu"]
{"$rows_left_out":16}
{"sheet":"Footnotes list","index":5,"n_rows":54,"n_cols":3,"rows_kept":54,"cut":false,"hidden":false,"merged":[[1,1,1,2]]}
[]
[null,"ANNUAL REPORTING OF PACKAGING AND PACKAGING WASTE\nFOOTNOTES LIST"]
[null,"Country:",{"$f":"IF('Basic instructions'!G11=\"\",\"\",'Basic instructions'!G11)","v":"Luxembourg"}]
[null,"Number","Country-specific footnotes"]
[null,1,"The main sorting facility for municipal plastic packaging waste was upgraded in 2018. This  has led to reduced amount of plastic packaging being recycled, compared to 2017, as packaging waste was not recycled or carried over into 2019. "]
[null,2,"Data on aluminium packaging is used from the EPR scheme. Currently the EPR scheme does only cover residential packaging. For aluminium packaging it can however be assumed that there is no commercial packaging."]
{"$rows_left_out":49}
{"sheet":"Table_1","index":6,"n_rows":35,"n_cols":38,"rows_kept":35,"cut":false,"hidden":false,"merged":[[4,26,4,29],[4,30,4,37],[1,5,1,37],[25,5,25,21],[4,5,5,5],[5,8,5,9],[5,12,5,13],[5,16,5,17],[5,20,5,21],[5,24,5,25],[5,28,5,29],[5,32,5,33],[5,36,5,37],[4,6,4,9],[4,10,4,25],[31,5,31,36],[34,5,34,36],[33,5,33,36],[28,5,28,34],[27,5,27,34]]}
[]
[null,null,null,null,null,"TABLE 1. Generation and recycling of packaging waste as established by Commission Decision 2005/270/EC\n as last amended by Commission Implementing Decision 2019/665(1) ( in tonnes)"]
[null,null,null,null,null,"Country:",{"$f":"'Basic instructions'!J11","v":"LU"},{"$f":"IF('Basic instructions'!G11=\"\",\"\",'Basic instructions'!G11)","v":"Luxembourg"}]
[null,null,null,null,null,"Reference year:",{"$f":"IF('Basic instructions'!G12=\"\",\"\",'Basic instructions'!G12)","v":2018}]
[null,null,null,null,null,"Packaging waste material"," Generation",null,null,null,"Recycling\n(The total weight of waste of each material type, at the relevant calculation points)",null,null,null,null,null,null,null,null,null,null,null,null,null,null,null," Repair",null,null,null,"Recovery"]
[null,null,null,null,null,null,"Waste generation (a)","Standard footnotes","Explanatory\nfootnote",null,"Recycling in the Member State ","Standard footnotes","Explanatory\nfootnote",null,"Recycling in other Member States ","Standard footnotes","Explanatory\nfootnote",null,"Recycling outside the EU ","Standard footnotes","Explanatory\nfootnote",null,"Recycling (Total )","Standard footnotes","Explanatory\nfootnote",null,"Repair of wooden packaging ","Standard footnotes","Explanatory\nfootnote",null,"Energy recovery(2) (R1)","Standard footnotes","Explanatory\nfootnote",null,"Other recovery (3)","Standard footnotes","Explanatory\nfootnote"]
{"$rows_left_out":30}
{"sheet":"Table_1a","index":7,"n_rows":28,"n_cols":14,"rows_kept":28,"cut":false,"hidden":false,"merged":[[1,4,1,13],[20,4,20,10],[18,4,18,12],[14,4,14,5],[15,4,15,5],[7,4,7,5],[8,4,8,5],[9,4,9,5],[10,4,12,4],[13,4,13,5],[27,4,27,12],[25,4,25,12],[26,4,26,12],[24,4,24,12],[6,4,6,5],[6,12,6,13],[6,8,6,9]]}
[]
[null,null,null,null,"TABLE 1a. Generation and recycling of packaging waste calculated according to the old rules as set out in Articles 3, 4 and 5 of Decision 2005/270/EC (1) for proving compliance with the old recycling targets in Article 6 (1) of Directive 94/62/EC ( in tonnes) - to be filled in only by the Member States wanting to prove compliance with the old targets until 2025 (and beyond) using the old rules."]
[null,null,null,null,"Country:",{"$f":"'Basic instructions'!J11","v":"LU"},{"$f":"IF('Basic instructions'!G11=\"\",\"\",'Basic instructions'!G11)","v":"Luxembourg"}]
[null,null,null,null,"Reference year:",{"$f":"IF('Basic instructions'!G12=\"\",\"\",'Basic instructions'!G12)","v":2018}]
[]
[null,null,null,null,"wst_oper ==>",null,"GEN_ORT",null,null,null,"RCY_ORT"]
{"$rows_left_out":23}
{"sheet":"Table_2","index":8,"n_rows":23,"n_cols":10,"rows_kept":23,"cut":false,"hidden":false,"merged":[[22,5,22,9],[0,5,0,9],[16,5,16,9]]}
[null,null,null,null,null,"Table 2. Adjusted level of the targets in accordance with Article 5(2) of Directive 94/62/EC (1)"]
[null,null,null,null,null,"Country:",{"$f":"'Basic instructions'!J11","v":"LU"},{"$f":"IF('Basic instructions'!G11=\"\",\"\",'Basic instructions'!G11)","v":"Luxembourg"}]
[null,null,null,null,null,"Reference year:",{"$f":"IF('Basic instructions'!G12=\"\",\"\",'Basic instructions'!G12)","v":2018}]
[null,null,null,null,null,"wst_oper ==>","FMKT_RE_S","FMKT_RE_S","FMKT_RE_S","FMKT_RE_S"]
[null,null,null,null,null,"time ==>",{"$f":"$G$3 -3","v":2015},{"$f":"$G$3 -2","v":2016},{"$f":"$G$3 -1","v":2017},{"$f":"G3","v":2018}]
[null,null,null,null,null,1,2,3,4,5]
{"$rows_left_out":18}
{"sheet":"Table_3","index":9,"n_rows":30,"n_cols":46,"rows_kept":30,"cut":false,"hidden":false,"merged":[[8,44,8,45],[8,16,8,17],[8,32,8,33],[8,40,8,41],[8,8,8,9],[8,12,8,13],[8,20,8,21],[8,24,8,25],[8,28,8,29],[0,5,0,45],[7,14,7,21],[7,6,7,13],[7,22,7,25],[7,26,7,29],[6,22,6,29],[7,30,7,37],[7,38,7,45],[6,30,6,45],[6,6,6,21],[29,5,29,42],[6,5,8,5],[26,5,26,42],[27,5,27,42],[28,5,28,42],[25,5,25,42],[20,5,20,10],[21,5,21,10],[8,36,8,37]]}
[null,null,null,null,null,"TABLE 3. Reporting on reusable packaging as established by Commission Decision 2005/270/EC\n as last amended by Commission Implementing Decision 2019/665 (1)"]
[null,null,null,null,null,"Country:",{"$f":"'Basic instructions'!J11","v":"LU"},{"$f":"IF('Basic instructions'!G11=\"\",\"\",'Basic instructions'!G11)","v":"Luxembourg"}]
[null,null,null,null,null,"Reference year:",{"$f":"IF('Basic instructions'!G12=\"\",\"\",'Basic instructions'!G12)","v":2018}]
[null,null,null,null,null,"unit ==>","T",null,null,null,"NR",null,null,null,"T",null,null,null,"NR",null,null,null,"T",null,null,null,"T",null,null,null,"T",null,null,null,"NR",null,null,null,"T",null,null,null,"NR"]
[null,null,null,null,null,"wst_oper","FMKT",null,null,null,"FMKT",null,null,null,"FMKT_S",null,null,null,"FMKT_S",null,null,null,"FMKT_RE",null,null,null,"FMKT_RE_S",null,null,null,"ROTY_RE    ",null,null,null,"ROTY_RE    ",null,null,null,"ROTY_RE_S",null,null,null,"ROTY_RE_S"]
[null,null,null,null,null,1,2,null,null,null,3,null,null,null,4,null,null,null,5,null,null,null,6,null,null,null,7,null,null,null,8,null,null,null,9,null,null,null,10,null,null,null,11]
{"$rows_left_out":25}
{"sheet":"ErrorLog","index":10,"n_rows":1,"n_cols":7,"rows_kept":1,"cut":false,"hidden":false,"merged":[]}
["Link to Error","Validation Rule","Cell","Sheet","Description","Severity","Former Color"]

{"sheet":"Lists","index":11,"n_rows":42,"n_cols":5,"rows_kept":42,"cut":false,"hidden":true,"merged":[]}
["Country label","Country code",null,"Valid flags","Label"]
["Belgium","BE",null,"B","break in time series"]
["Bulgaria","BG",null,"E","estimated data"]
["Czechia","CZ",null,"P","provisional"]
["Denmark","DK",null,"BE"]
["Germany","DE",null,"BP"]
{"$rows_left_out":37}
{"sheet":"Locks","index":12,"n_rows":5,"n_cols":8,"rows_kept":5,"cut":false,"hidden":true,"merged":[]}
["Sheet Name","Top Left Cell","Bottom Right Cell","Row Step","Column Step","Lock Type","Focus Back To","Content is Mandatory"]
["Table_1","G18","AI18",999,4,"Formulas","G8","YES"]
["Table_1","G10","AI10",999,4,"Formulas","G8","YES"]
["Table_1a","G16","K16",999,4,"Formulas","G8","YES"]
["Table_3","G17","AQ17",999,4,"Formulas","G10","YES"]

{"sheet":"CountryName","index":13,"n_rows":16,"n_cols":6,"rows_kept":16,"cut":false,"hidden":true,"merged":[]}
["Severity","SheetName","TopLeftCell","BottomRightCell","RowStep","ColumnStep"]
["Error","Basic instructions","G11","G11",1,1]
[]
[]
[]
["DESCRIPTION"]
{"$rows_left_out":11}
{"sheet":"Summations","index":14,"n_rows":115,"n_cols":11,"rows_kept":115,"cut":false,"hidden":true,"merged":[[16,5,16,6]]}
["Severity","Sheet Name","List of Cells\n (first block)","First Total Cell (first block)","Last Total Cell\n(Last block)","Row Block Repetition Step","Column Block Repetition Step","Greater or Equal","Valid Tolerance","Only if all data is available","Display text in error"]
["Error","Table_1","G8,G9,G10,G15,G16,G17","G18","AI18",999,4,"EQ",0.1,"YES","Total waste not consistent to the sum of materials"]
["Error","Table_1","K8,O8,S8","W8","W18",1,999,"GE",0.1,"NO","Total Recycling must be greater than the sum of its components"]
["Error","Table_1","K8,O8,S8","W8","W18",1,999,"EQ",0.1,"YES","Total Recycling must be equal than the sum of its components"]
["Error","Table_1","G11,G12","G10","AI10",999,4,"EQ",0.1,"YES","Total metals not consistent to the sum of Al + Fe"]
["Error","Table_1","K8,O8,S8,AA8,AE8,AI8","G8","G18",1,999,"GT",0,"NO","Generation must be bigger than the sum of all other columns"]
{"$rows_left_out":110}
{"sheet":"Mandatory","index":15,"n_rows":16,"n_cols":8,"rows_kept":16,"cut":false,"hidden":true,"merged":[]}
["Severity","SheetName","Top Left Cell","Bottom Right Cell","Row Step","Column Step","Empty Is Valid If Footnote Exists","Footnote Shift From Value"]
["Error","Basic instructions","D16","D24",2,999,"NO",3]
["Error","Table_1","G8","W10",1,4,"YES",3]
["Error","Table_1","G15","W18",1,4,"YES",3]
["Error","Table_1","AE8","AI10",1,4,"YES",3]
["Error","Table_1","AI15","AI15",1,4,"YES",3]
{"$rows_left_out":11}
{"sheet":"MustNotBeNegative","index":16,"n_rows":5,"n_cols":6,"rows_kept":5,"cut":false,"hidden":true,"merged":[]}
["Severity","SheetName","TopLeftCell","BottomRightCell","RowStep","ColumnStep"]
["Error","Table_1","G8","AI18",1,4]
["Error","Table_1a","G8","K16",1,4]
["Error","Table_2","G8","J14",1,4]
["Error","Table_3","G10","AQ17",1,4]

{"sheet":"Thresholds","index":17,"n_rows":2,"n_cols":10,"rows_kept":2,"cut":false,"hidden":true,"merged":[]}
["Severity","SheetName","Top Left Cell","Bottom Right Cell","Row Step","Column Step","Lower value","Upper value","Error Is Valid If Footnote Exists","Footnote Shift From Value"]
["Error","Table_2","G8","J14",1,1,0,100,"NO",999]

{"sheet":"IsFormula","index":18,"n_rows":6,"n_cols":6,"rows_kept":6,"cut":false,"hidden":true,"merged":[]}
["Severity","Sheet Name","Top Left Cell","Bottom Right Cell","Row Step","Column Step"]
["Info","Table_1","G18","AI18",999,4]
["Info","Table_1","G10","W10",999,4]
["Info","Table_1","AE10","AI10",999,4]
["Info","Table_1a","G16","K16",999,4]
["Info","Table_3","G17","AQ17",999,4]
{"$rows_left_out":1}
{"sheet":"FootnoteContent","index":19,"n_rows":4,"n_cols":7,"rows_kept":4,"cut":false,"hidden":true,"merged":[]}
["Severity","SheetName","TopLeftCell","BottomRightCell","RowStep","ColumnStep","DistanceFromReferenceToText"]
["Error","Table_1","I8","AK18",1,4,1]
["Error","Table_1a","I8","M16",1,4,1]
["Error","Table_3","I10","AS17",1,4,1]

{"sheet":"IsNumeric","index":20,"n_rows":5,"n_cols":9,"rows_kept":5,"cut":false,"hidden":true,"merged":[]}
["Severity","SheetName","TopLeftCell","BottomRightCell","RowStep","ColumnStep"]
["Error","Table_1","G8","AI18",1,4,null,null,"it is meant to check that there are numerical values"]
["Error","Table_1a","G8","K16",1,4]
["Error","Table_2","G8","J14",1,1]
["Error","Table_3","G10","AQ17",1,4]

{"sheet":"Validation rules","index":21,"n_rows":37,"n_cols":4,"rows_kept":37,"cut":false,"hidden":true,"merged":[]}
[null,"This sheet shows checks that Eurostat plans to implement in an automatic way - to be completed"]
["Preliminary checks:"]
[]
[null,"The reporting country name and Reference year must be filled in the sheet \"Basic Instructions\"."]
[null,"Primary contact point should be filled."]
[]
{"$rows_left_out":32}
{"sheet":"Quality_report >>>","index":22,"n_rows":13,"n_cols":10,"rows_kept":13,"cut":false,"hidden":false,"merged":[[12,0,12,10],[3,6,3,10],[3,0,3,5],[0,3,0,7],[6,9,6,10]]}
[null,null,null,"Packaging and Packaging Waste\nQUALITY REPORT"]
[null,null," "]
[]
["Quality report",null,null,null,null,null,"Sheet(s)"]
["1. General information",null,null,null,null,null,"Overview & Waste Gen."]
["2. Description of the parties involved in the data collection",null,null,null,null,null,"Overview & Waste Gen."]
{"$rows_left_out":8}
{"sheet":"Overview & Waste Gen.","index":23,"n_rows":117,"n_cols":12,"rows_kept":117,"cut":false,"hidden":false,"merged":[[46,0,46,2],[47,0,47,2],[52,0,52,11],[81,4,81,6],[82,4,82,6],[78,7,78,11],[79,7,79,11],[80,7,80,11],[81,7,81,11],[82,7,82,11],[75,0,75,3],[78,0,78,3],[82,0,82,3],[64,4,64,11],[65,4,65,11],[66,4,66,11],[64,0,64,3],[65,0,65,3],[70,0,70,3],[67,4,67,11],[69,0,69,11],[83,0,83,11],[99,0,99,11],[117,0,117,11],[108,0,108,11],[74,4,74,11],[62,0,62,11],[55,0,55,11],[48,0,48,2],[49,0,49,2],[50,0,50,2],[51,0,51,11],[79,0,79,3],[80,0,80,3],[78,4,78,6],[79,4,79,6],[80,4,80,6],[75,4,75,11],[71,0,71,3],[74,0,74,3],[67,0,67,3],[116,7,116,8],[116,1,116,2],[106,0,106,11],[109,5,109,6],[110,9,110,10],[111,9,111,10],[95,0,95,2],[115,5,115,6],[114,9,114,10],[115,9,115,10],[116,9,116,10],[113,1,113,2],[113,3,113,4],[114,3,114,4],[115,3,115,4],[96,0,96,2],[109,1,109,2],[109,3,109,4],[110,3,110,4],[113,7,113,8],[112,9,112,10],[113,9,113,10],[98,0,98,2],[116,5,116,6],[116,3,116,4],[113,5,113,6],[114,7,114,8],[115,7,115,8],[111,3,111,4],[103,0,103,11],[105,0,105,11],[85,0,85,11],[88,0,88,11],[111,1,111,2],[112,1,112,2],[100,0,100,11],[89,7,90,7],[89,8,90,8],[89,9,90,9],[89,10,90,10],[109,7,109,8],[110,7,110,8],[111,7,111,8],[112,7,112,8],[92,0,92,2],[93,0,93,2],[94,0,94,2],[90,0,90,2],[89,4,90,4],[89,0,89,2],[114,5,114,6],[66,0,66,3],[112,3,112,4],[110,1,110,2],[102,0,102,11],[81,0,81,3],[77,0,77,11],[97,0,97,2],[61,9,61,10],[68,0,68,11],[76,0,76,11],[84,0,84,11],[86,0,86,11],[87,0,87,11],[89,3,90,3],[101,0,101,11],[107,0,107,11],[91,0,91,2],[109,9,109,10],[111,5,111,6],[104,0,104,11],[112,5,112,6],[89,5,90,5],[89,6,90,6],[110,5,110,6],[53,0,53,11],[5,0,5,4],[5,5,5,11],[18,0,18,11],[6,0,6,4],[6,5,6,11],[19,0,19,11],[20,0,20,10],[21,0,21,11],[17,0,17,4],[17,5,17,11],[10,5,10,11],[11,0,11,4],[11,5,11,11],[22,0,22,11],[23,0,23,11],[24,0,24,11],[42,0,42,11],[25,10,25,11],[26,10,26,11],[27,10,27,11],[28,10,28,11],[29,10,29,11],[25,0,25,9],[0,3,0,7],[3,0,3,10],[4,0,4,4],[4,5,4,11],[12,0,12,11],[13,0,13,10],[15,0,15,4],[15,5,15,11],[16,0,16,4],[16,5,16,11],[14,0,14,11],[7,0,7,4],[7,5,7,11],[8,0,8,4],[8,5,8,11],[9,0,9,4],[9,5,9,11],[10,0,10,4],[26,0,26,9],[27,0,27,9],[28,0,28,9],[29,0,29,9],[44,11,45,11],[31,0,31,11],[32,0,32,11],[43,0,43,11],[44,0,45,2],[44,3,44,10],[30,0,30,11],[33,0,34,2],[33,3,33,10],[33,11,34,11],[35,0,35,2],[36,0,36,2],[37,0,37,2],[38,0,38,2],[39,0,39,2],[40,0,40,11],[41,0,41,11],[56,7,57,8],[56,9,57,10],[54,0,54,11],[56,3,57,4],[56,5,56,6],[60,0,60,2],[61,0,61,2],[63,0,63,11],[58,3,58,4],[58,7,58,8],[58,9,58,10],[59,3,59,4],[60,3,60,4],[61,3,61,4],[61,7,61,8],[56,0,56,2],[57,0,57,2],[58,0,58,2],[59,0,59,2]]}
[null,null,null,"Packaging and Packaging Waste\nQUALITY REPORT"]
[null,null," "]
[]
["1. General information"]
["1.1. Member State",null,null,null,null,"Luxembourg"]
["1.2. Organisation submitting the data and the description"," ",null,null,null,"Administration de l’environnement"]
{"$rows_left_out":112}
{"sheet":"Waste Management","index":24,"n_rows":98,"n_cols":11,"rows_kept":98,"cut":false,"hidden":false,"merged":[[3,0,3,11],[0,3,0,7],[10,10,11,10],[11,0,11,2],[12,0,12,2],[4,0,4,11],[5,0,5,11],[6,0,6,11],[7,0,7,11],[8,0,8,11],[10,0,10,2],[10,3,11,3],[10,4,11,4],[10,5,11,5],[10,6,11,6],[13,0,13,2],[14,0,14,2],[15,0,15,2],[16,0,16,2],[17,0,17,2],[18,0,18,2],[10,7,11,7],[10,8,11,8],[10,9,11,9],[28,1,28,4],[28,5,28,10],[29,1,29,4],[29,5,29,10],[30,1,30,4],[30,5,30,10],[19,0,19,2],[20,0,20,11],[21,0,21,11],[22,0,22,11],[24,0,24,11],[25,0,25,11],[26,0,26,11],[34,1,34,4],[34,5,34,10],[35,1,35,4],[35,5,35,10],[37,0,37,11],[38,0,38,11],[31,1,31,4],[31,5,31,10],[32,1,32,4],[32,5,32,10],[33,1,33,4],[33,5,33,10],[45,0,45,11],[46,0,46,11],[48,1,48,4],[48,6,48,10],[49,1,49,4],[49,6,49,10],[39,0,39,11],[40,0,40,11],[41,0,41,11],[42,0,42,11],[43,0,43,11],[44,0,44,11],[56,1,56,2],[56,3,56,4],[56,5,56,6],[56,7,56,10],[66,0,66,11],[67,0,67,11],[51,0,51,11],[52,0,52,11],[54,1,54,2],[54,3,54,4],[54,5,54,6],[54,7,54,10],[57,1,57,2],[57,3,57,4],[57,5,57,6],[57,7,57,10],[58,1,58,2],[58,3,58,4],[58,5,58,6],[58,7,58,10],[59,1,59,2],[59,3,59,4],[59,5,59,6],[59,7,59,10],[72,0,72,11],[73,0,73,11],[74,0,74,11],[75,0,75,11],[76,0,76,11],[77,0,77,11],[69,1,69,2],[69,3,69,4],[69,5,69,6],[69,7,69,10],[70,1,70,2],[70,3,70,4],[70,5,70,6],[70,7,70,10],[84,9,84,10],[85,1,85,2],[85,3,85,4],[85,5,85,6],[85,7,85,8],[85,9,85,10],[78,0,78,11],[79,0,79,11],[80,0,80,11],[81,0,81,11],[83,1,83,2],[83,3,83,4],[83,5,83,6],[83,7,83,8],[83,9,83,10],[97,0,97,4],[97,5,97,11],[91,0,91,11],[92,0,92,11],[94,0,94,4],[94,5,94,11],[95,0,95,4],[95,5,95,11],[88,1,88,2],[88,3,88,4],[88,5,88,6],[88,7,88,8],[88,9,88,10],[89,1,89,2],[89,3,89,4],[89,5,89,6],[89,7,89,8],[89,9,89,10],[60,1,60,2],[60,3,60,4],[60,5,60,6],[60,7,60,10],[61,1,61,2],[61,3,61,4],[61,5,61,6],[61,7,61,10],[96,0,96,4],[96,5,96,11],[86,1,86,2],[86,3,86,4],[86,5,86,6],[86,7,86,8],[86,9,86,10],[87,1,87,2],[87,3,87,4],[87,5,87,6],[87,7,87,8],[87,9,87,10],[84,1,84,2],[84,3,84,4],[84,5,84,6],[84,7,84,8],[62,1,62,2],[62,3,62,4],[62,5,62,6],[62,7,62,10],[63,1,63,2],[63,3,63,4],[63,5,63,6],[63,7,63,10],[64,1,64,2],[64,3,64,4],[64,5,64,6],[64,7,64,10]]}
[null,null,null,"Packaging and Packaging Waste\nQUALITY REPORT"]
[null,null," "]
[]
["3.2. Packaging waste management"]
["3.2.1. Classifications of treatment operations \n\nInformation on the classification used for treatment operations (if a standard classification is used such as the disposal operation or recovery operation codes established in Annexes I and II of Directive 2008/98/EC, refer to its name or specify and describe all the relevant categories used). "]
["State clearly whether the R/D codes in Annexes I and II of Directive 2008/98/EC are solely used, or whether additional national based classifications are used to complement or are used instead of R/D codes. Where there is any variation from the codes set out in the annexes, the full list of national codes must be described. The correlation of any national codes and the codes in the annexes must be made explicit in the response."]
{"$rows_left_out":93}
{"sheet":"Data Accuracy","index":25,"n_rows":26,"n_cols":11,"rows_kept":26,"cut":false,"hidden":false,"merged":[[3,0,3,10],[0,3,0,7],[16,0,16,11],[4,0,4,11],[5,0,5,11],[6,0,6,11],[7,0,7,11],[8,0,8,11],[9,0,9,11],[10,0,10,11],[12,8,12,9],[13,8,13,9],[14,0,14,11],[15,0,15,11],[23,1,23,4],[23,6,23,10],[17,0,17,11],[18,0,18,11],[19,0,19,11],[20,0,20,11],[22,1,22,4],[22,6,22,10]]}
[null,null,null,"Packaging and Packaging Waste\nQUALITY REPORT"]
[null,null," "]
[]
["3.3. Accuracy of the data for packaging waste generation and treatment "]
["3.3.1. Description of main issues affecting the accuracy of data on the generation and treatment of packaging waste, including errors related to sampling, coverage, measurement, processing and non-response "]
["Challenges:\n•\tanalysist of over 800 reports \n•\tdifferent EWC codes at input and output of sorting facility\n•\twaste streams between waste handlers\n•\twrongly attributed EWC codes and treatment codes\n•\tFinal treatment often unknown when waste is exported to another waste sorting facility abroad"]
{"$rows_left_out":21}
{"sheet":"Reusable & Traceability","index":26,"n_rows":35,"n_cols":11,"rows_kept":35,"cut":false,"hidden":false,"merged":[[9,0,9,11],[3,0,3,10],[0,3,0,7],[4,0,4,11],[5,0,5,11],[6,0,6,11],[7,0,7,11],[8,0,8,11],[23,0,23,11],[10,0,10,11],[12,8,12,9],[13,8,13,9],[14,0,14,11],[15,0,15,11],[16,0,16,11],[17,0,17,11],[18,0,18,11],[21,0,21,11],[22,0,22,11],[19,0,19,11],[20,0,20,11],[26,0,26,2],[26,3,26,4],[26,5,26,6],[26,7,26,8],[26,9,26,11],[25,0,25,2],[25,3,25,4],[25,5,25,6],[25,7,25,8],[25,9,25,11],[28,0,28,2],[28,3,28,4],[28,5,28,6],[28,7,28,8],[28,9,28,11],[27,0,27,2],[27,3,27,4],[27,5,27,6],[27,7,27,8],[27,9,27,11],[30,0,30,2],[30,3,30,4],[30,5,30,6],[30,7,30,8],[30,9,30,11],[29,0,29,2],[29,3,29,4],[29,5,29,6],[29,7,29,8],[29,9,29,11],[34,0,34,11],[35,0,35,11],[31,0,31,2],[31,3,31,4],[31,5,31,6],[31,7,31,8],[31,9,31,11],[32,0,32,2],[32,3,32,4],[32,5,32,6],[32,7,32,8],[32,9,32,11]]}
[null,null,null,"Packaging and Packaging Waste\nQUALITY REPORT"]
[null,null," "]
[]
["3.5. Accuracy of the data for reusable packaging"]
["3.5.1. Description of main issues affecting the accuracy of data on reusable packaging, including errors related to sampling, coverage, measurement, processing and non-response "]
["NA"]
{"$rows_left_out":30}
{"sheet":"Confidentiality & References","index":27,"n_rows":12,"n_cols":4,"rows_kept":12,"cut":false,"hidden":false,"merged":[[11,0,11,11],[3,0,3,10],[4,0,4,11],[5,0,5,11],[0,3,0,7],[6,0,6,11],[7,0,7,10],[8,0,8,11],[10,0,10,11],[9,0,9,11]]}
[null,null,null,"Packaging and Packaging Waste\nQUALITY REPORT"]
[null,null," "]
[]
["5. Confidentiality"]
["Justification to withhold the publication of specific parts of this report (please indicate the exact elements not to be published, and why)"]
["If a part of this report cannot be published for confidentiality reasons, please provide your justification for doing so here and specify exactly which part should not be publisihed."]
{"$rows_left_out":7}
{"sheet":"Any further detailed data...","index":28,"n_rows":2,"n_cols":1,"rows_kept":2,"cut":false,"hidden":false,"merged":[[1,0,1,8],[2,0,2,8],[3,0,3,8]]}
[]
["Any further detailed data may be added in this sheet. For example, if the waste generation figures are available at a higher level of granularity than the main material categories of Table 1."]