{"text_format":"1","workbook":"xlsx","n_sheets":27,"sheets":["COVER","INDEX","Basic Instructions","Methodology","Validation rules","GETTING STARTED","Footnotes list","Table_1","Table_1 (Prefilling)","Table_2","Table_2 (Prefilling)","VoluntaryReporting","ErrorLog","Changelog","Pre-filling parameters","Lists","Locks","NotStandardRules","CannotBeZero","Thresholds","IsFormula - cancelled","Summations","SimpleRatios","Mandatory","MustNotBeNegative","FoototeContent","IsNumeric"],"not_rendered":{"charts":0,"images":4,"macros":1,"external_links":0,"defined_names":2,"comments":4,"pivot_tables":0},"unopened":[],"bounds":{"document_bytes":16777216,"sheet_cells":100000,"rows_first":2000,"rows_last":500,"rows_between":2000,"halvings":0,"cell_chars":16384,"cell_head_chars":4096},"cells_cut":0,"cells_raw":0,"read":"whole","date_system":"1900"}

{"sheet":"COVER","index":0,"n_rows":9,"n_cols":3,"rows_kept":9,"cut":false,"hidden":false,"merged":[]}
[]
[]
[null,null,{"$f":"UPPER(Lists!K3)","v":"STATISTICAL OFFICE OF THE EUROPEAN UNION"}]
[]
[null,null,{"$f":"Lists!K4","v":"Directorate E: Sectoral and regional statistics"}]
[null,null,{"$f":"Lists!K5","v":"Unit E-2: Environmental statistics and accounts; sustainable development"}]
{"$rows_left_out":4}
{"sheet":"INDEX","index":1,"n_rows":22,"n_cols":5,"rows_kept":22,"cut":false,"hidden":false,"merged":[[14,2,14,4],[1,2,1,4],[3,2,3,4],[4,2,4,4],[6,2,6,4],[8,2,8,4]]}
[]
[]
[null,null,null,null,{"$f":"UPPER(Lists!K3)","v":"STATISTICAL OFFICE OF THE EUROPEAN UNION"}]
[null,null,{"$f":"UPPER(Lists!K7)","v":"ANNUAL REPORTING ON BATTERIES AND ACCUMULATORS AND WASTE BATTERIES AND ACCUMULATORS"}]
[null,null,{"$f":"CONCATENATE(Lists!K8,\" DATA COLLECTION\")","v":"2022 DATA COLLECTION"}]
[]
{"$rows_left_out":17}
{"sheet":"Basic Instructions","index":2,"n_rows":93,"n_cols":6,"rows_kept":93,"cut":false,"hidden":false,"merged":[[81,2,81,5],[82,2,82,5],[76,2,76,5],[78,2,78,5],[74,2,74,5],[34,2,34,5],[39,2,39,5],[40,2,40,5],[61,2,61,5],[44,2,44,5],[46,2,46,5],[48,2,48,5],[49,2,49,5],[50,2,50,5],[53,2,53,5],[59,2,59,5],[60,2,60,5],[41,2,41,5],[42,2,42,5],[16,2,16,5],[19,2,19,5],[21,2,21,5],[25,2,25,5],[32,2,32,5],[18,2,18,5],[14,2,14,5],[3,2,3,5],[4,2,4,5],[6,2,6,5],[7,2,7,5],[8,2,8,5],[9,2,9,5],[10,2,10,5],[11,2,11,5],[12,2,12,5],[13,2,13,5],[63,2,63,5],[65,2,65,5],[66,2,66,5],[68,2,68,5],[69,2,69,5],[70,2,70,5],[71,2,71,5],[91,2,91,5],[92,2,92,5],[89,2,89,5],[90,2,90,5],[88,2,88,5],[85,2,85,5],[86,2,86,5],[87,2,87,5],[79,2,79,5],[80,2,80,5],[84,2,84,5],[83,2,83,5],[72,2,72,5],[77,2,77,5]]}
[]
[]
[null,null,null,null,null,{"$f":"UPPER(Lists!K3)","v":"STATISTICAL OFFICE OF THE EUROPEAN UNION"}]
[null,null,{"$f":"UPPER(Lists!K7)","v":"ANNUAL REPORTING ON BATTERIES AND ACCUMULATORS AND WASTE BATTERIES AND ACCUMULATORS"}]
[null,null,{"$f":"CONCATENATE(Lists!K8,\" DATA COLLECTION\")","v":"2022 DATA COLLECTION"}]
[]
{"$rows_left_out":88}
{"sheet":"Methodology","index":3,"n_rows":37,"n_cols":6,"rows_kept":37,"cut":false,"hidden":false,"merged":[[9,2,9,5],[3,2,3,5],[4,2,4,5],[6,2,6,5],[7,2,7,5],[8,2,8,5],[26,2,26,5],[27,2,27,5],[28,2,28,5],[29,2,29,5],[10,2,10,5],[12,2,12,5],[14,2,14,5],[19,2,19,5],[22,2,22,5],[24,2,24,5],[21,2,21,5],[17,2,17,5],[16,2,16,5],[15,2,15,5],[31,2,31,5],[33,2,33,5],[34,2,34,5],[35,2,35,5],[36,2,36,5]]}
[]
[]
[null,null,null,null,null,{"$f":"UPPER(Lists!K3)","v":"STATISTICAL OFFICE OF THE EUROPEAN UNION"}]
[null,null,{"$f":"UPPER(Lists!K7)","v":"ANNUAL REPORTING ON BATTERIES AND ACCUMULATORS AND WASTE BATTERIES AND ACCUMULATORS"}]
[null,null,{"$f":"CONCATENATE(Lists!K8,\" DATA COLLECTION\")","v":"2022 DATA COLLECTION"}]
[]
{"$rows_left_out":32}
{"sheet":"Validation rules","index":4,"n_rows":54,"n_cols":6,"rows_kept":54,"cut":false,"hidden":false,"merged":[[10,2,10,5],[3,2,3,5],[4,2,4,5],[6,2,6,5],[8,2,8,5],[9,2,9,5],[25,2,25,5],[11,3,11,5],[12,3,12,5],[13,2,13,5],[14,2,14,5],[15,3,15,5],[16,3,16,5],[17,2,17,5],[18,2,18,5],[19,2,19,5],[20,2,20,5],[23,2,23,5],[32,2,32,5],[35,3,35,5],[36,3,36,5],[26,2,26,5],[27,2,27,5],[29,2,29,5],[31,2,31,5],[33,2,33,5],[34,3,34,5],[51,2,51,5],[53,2,53,5],[43,3,43,5],[37,2,37,5],[45,3,45,5],[48,3,48,5],[49,3,49,5],[39,3,39,5],[40,3,40,5],[47,3,47,5],[46,3,46,5],[38,3,38,5],[44,3,44,5],[41,3,41,5],[42,3,42,5]]}
[]
[]
[null,null,null,null,null,{"$f":"UPPER(Lists!K3)","v":"STATISTICAL OFFICE OF THE EUROPEAN UNION"}]
[null,null,{"$f":"UPPER(Lists!K7)","v":"ANNUAL REPORTING ON BATTERIES AND ACCUMULATORS AND WASTE BATTERIES AND ACCUMULATORS"}]
[null,null,{"$f":"CONCATENATE(Lists!K8,\" DATA COLLECTION\")","v":"2022 DATA COLLECTION"}]
[]
{"$rows_left_out":49}
{"sheet":"GETTING STARTED","index":5,"n_rows":23,"n_cols":7,"rows_kept":23,"cut":false,"hidden":false,"merged":[[22,2,22,6],[3,2,3,6],[4,2,4,6],[13,3,13,6],[15,3,15,6],[17,3,17,6],[19,3,19,6],[21,3,21,6],[11,2,11,6],[6,2,6,6]]}
[]
[]
[null,null,null,null,null,null,{"$f":"UPPER(Lists!K3)","v":"STATISTICAL OFFICE OF THE EUROPEAN UNION"}]
[null,null,{"$f":"UPPER(Lists!K7)","v":"ANNUAL REPORTING ON BATTERIES AND ACCUMULATORS AND WASTE BATTERIES AND ACCUMULATORS"}]
[null,null,{"$f":"CONCATENATE(Lists!K8,\" DATA COLLECTION\")","v":"2022 DATA COLLECTION"}]
[]
{"$rows_left_out":18}
{"sheet":"Footnotes list","index":6,"n_rows":58,"n_cols":5,"rows_kept":58,"cut":false,"hidden":false,"merged":[[1,3,1,4],[3,3,3,4],[4,3,4,4],[6,3,6,4],[7,3,7,4]]}
[]
[]
[null,null,null,null,{"$f":"UPPER(Lists!K3)","v":"STATISTICAL OFFICE OF THE EUROPEAN UNION"}]
[null,null,null,{"$f":"UPPER(Lists!K7)","v":"ANNUAL REPORTING ON BATTERIES AND ACCUMULATORS AND WASTE BATTERIES AND ACCUMULATORS"}]
[null,null,null,{"$f":"CONCATENATE(Lists!K8,\" DATA COLLECTION\")","v":"2022 DATA COLLECTION"}]
[]
{"$rows_left_out":53}
{"sheet":"Table_1","index":7,"n_rows":29,"n_cols":29,"rows_kept":29,"cut":false,"hidden":false,"merged":[[20,4,20,5],[28,4,28,5],[25,4,25,5],[23,4,23,5],[24,4,24,5],[27,4,27,5],[26,4,26,5],[16,4,18,4],[6,16,6,17],[6,20,6,21],[6,24,6,25],[3,26,5,28],[3,4,3,25],[7,4,9,4],[10,4,12,4],[13,4,15,4],[6,8,6,9],[6,12,6,13]]}
[]
[]
[]
[null,null,null,null,"TABLE 1: Monitoring Compliance for Directive 2006/66/EC on batteries and accumulators and waste batteries and accumulators\nCollection of Portable Batteries and Accumulators",null,null,null,null,null,null,null,null,null,null,null,null,null,null,null,null,null,null,null,null,null,"PLAUSIBILITY WARNINGS"]
[null,null,null,null,"Country:",{"$f":"'GETTING STARTED'!G9","v":"LU"},{"$f":"IF('GETTING STARTED'!E9=\"\",\"\",'GETTING STARTED'!E9)","v":"Luxembourg"}]
[null,null,null,null,"Reference year:",{"$f":"IF('GETTING STARTED'!E10=\"\",\"\",'GETTING STARTED'!E10)","v":2020}]
{"$rows_left_out":24}
{"sheet":"Table_1 (Prefilling)","index":8,"n_rows":29,"n_cols":25,"rows_kept":29,"cut":false,"hidden":true,"merged":[[3,4,3,25],[6,16,6,17],[6,20,6,21],[6,24,6,25],[7,4,9,4],[6,12,6,13],[26,4,26,5],[27,4,27,5],[28,4,28,5],[6,8,6,9],[23,4,23,5],[24,4,24,5],[10,4,12,4],[13,4,15,4],[16,4,18,4],[20,4,20,5],[25,4,25,5]]}
[]
[]
[]
[null,null,null,null,"TABLE 1: PREFILLING"]
[null,null,null,null,"Country:",{"$f":"'GETTING STARTED'!G9","v":"LU"},{"$f":"IF('GETTING STARTED'!E9=\"\",\"\",'GETTING STARTED'!E9)","v":"Luxembourg"}]
[null,null,null,null,"Reference year:",{"$f":"IF('GETTING STARTED'!E10=\"\",\"\",'GETTING STARTED'!E10)","v":2020}]
{"$rows_left_out":24}
{"sheet":"Table_2","index":9,"n_rows":29,"n_cols":21,"rows_kept":29,"cut":false,"hidden":false,"merged":[[26,4,26,5],[27,4,27,5],[28,4,28,5],[3,18,5,20],[6,16,6,17],[6,12,6,13],[6,8,6,9],[3,5,3,17],[19,4,21,4],[7,4,9,4],[10,4,12,4],[13,4,15,4],[16,4,18,4]]}
[]
[]
[]
[null,null,null,null,null,"TABLE 2: Monitoring Compliance for Directive 2006/66/EC on batteries and accumulators and waste batteries and accumulators\nRecyling Efficiencies of the recycling processes on waste batteries and accumulators according to REG 493/2012\n",null,null,null,null,null,null,null,null,null,null,null,null,"PLAUSIBILITY WARNINGS"]
[null,null,null,null,"Country:",{"$f":"'GETTING STARTED'!G9","v":"LU"},{"$f":"IF('GETTING STARTED'!E9=\"\",\"\",'GETTING STARTED'!E9)","v":"Luxembourg"}]
[null,null,null,null,"Reference year:",{"$f":"IF('GETTING STARTED'!E10=\"\",\"\",'GETTING STARTED'!E10)","v":2020}]
{"$rows_left_out":24}
{"sheet":"Table_2 (Prefilling)","index":10,"n_rows":29,"n_cols":17,"rows_kept":29,"cut":false,"hidden":true,"merged":[[28,4,28,5],[3,4,3,17],[10,4,12,4],[13,4,15,4],[16,4,18,4],[19,4,21,4],[26,4,26,5],[27,4,27,5],[6,8,6,9],[6,12,6,13],[6,16,6,17],[7,4,9,4]]}
[]
[]
[]
[null,null,null,null,"TABLE 2: PRE-FILLING"]
[null,null,null,null,"Country:",{"$f":"'GETTING STARTED'!G9","v":"LU"},{"$f":"IF('GETTING STARTED'!E9=\"\",\"\",'GETTING STARTED'!E9)","v":"Luxembourg"}]
[null,null,null,null,"Reference year:",{"$f":"IF('GETTING STARTED'!E10=\"\",\"\",'GETTING STARTED'!E10)","v":2020}]
{"$rows_left_out":24}
{"sheet":"VoluntaryReporting","index":11,"n_rows":23,"n_cols":24,"rows_kept":23,"cut":false,"hidden":false,"merged":[[21,1,21,3],[21,4,21,23],[22,1,22,3],[22,4,22,23],[17,1,18,1],[17,2,17,23],[18,2,18,23],[19,1,19,3],[19,4,19,23],[20,1,20,3],[20,4,20,23],[3,1,4,1],[16,3,16,23],[1,2,1,23],[2,2,2,23],[3,3,3,23],[4,3,4,6],[4,7,4,10],[4,11,4,14],[4,15,4,18],[4,19,4,22],[11,3,11,23],[12,3,12,23],[13,3,13,23],[14,3,14,23],[15,3,15,23]]}
[]
[null,null,"Special note for the attention of the reporting officer: \nThis voluntary sheet is treated as confidential and will only be shared with DG ENV, DG JRC and companies collaborating with the Commission under specific contracts, for data validation and research purposes.\nThe objective of the voluntary reporting is focused on: \n- diminish the validation and investigation burden on the country whenever there is a peculiar situation that prevents countries to ship batteries waste on a yearly basis,\n- to help the Commission to analyse the situations in which countries are not receiving from recyclers settled abroad the figures on their amounts of recycled batteries and their recycling rates (in this case, it is recommended to provide the ANNEX IV, V and VI sheets from the recyclers in the quality report).  \nIn addition to what countries are already providing in the QRs, Eurostat encourages countries to provide any data and information available in this sheet.\nThe voluntary sheet can be filled in and transmitted at any time. It is not necessary to fill in this sheet by 30 June (collection deadline). Once the voluntary sheet is compiled, it is strongly recommended that the country submit the questionnaire via eDAMIS, so that Eurostat can analyse the information and then report to the Commission whenever requested\nThis sheet is divide in two sections:  \n- section 1 is devoted for the voluntary reporting, in structured way, on stocks, shipments and landfilling, as well as additional descriptive textual information  \n- section 2 is devoted for specifid topics addressed in JRC researches.\nIn the event that these data (or part of it) are judged of high quality, Eurostat will contact the reporting officer asking for permission to publish parts of these information (e.g. as metadata). Only the finally agreed parts may be published."]
[null,"Country: ","Section 1: voluntary declarations on stocks, shipments and landfilling"]
[null,{"$f":" CONCATENATE('GETTING STARTED'!E9,\" \",'GETTING STARTED'!G9)","v":"Luxembourg LU"},"Unit: Tonnes","Voluntary table 3: Declaration of stocks levels (opening at 1.1.Year),  shipped for treatment, collected stocks and landfilled materials arising from batteries waste processing in the reference year per battery type in the country"]
[null,null,"Year",2016,null,null,null,2017,null,null,null,2018,null,null,null,2019,null,null,null,2020,null,null,null,2021]
[null,"waste code","type of battery","Stocks (open)","Shipped for treatment","Collected stocks","Landfilling","Stocks (open)","Shipped for treatment","Collected stocks","Landfilling","Stocks (open)","Shipped for treatment","Collected stocks","Landfilling","Stocks (open)","Shipped for treatment","Collected stocks","Landfilling","Stocks (open)","Shipped for treatment","Collected stocks","Landfilling","Stock (open)"]
{"$rows_left_out":18}
{"sheet":"ErrorLog","index":12,"n_rows":4,"n_cols":7,"rows_kept":4,"cut":false,"hidden":false,"merged":[]}
["Link to Error","Validation Rule","Cell","Sheet","Description","Severity","Former Color"]
["Go to cell","DomainSpecific","O13","Table_1","The value does not match the expected ratio (Collected/average put on the market last 3 years)","Error",13487565]
["Go to cell","DomainSpecific","O16","Table_1","The value does not match the expected ratio (Collected/average put on the market last 3 years)","Error",13487565]
["Go to cell","DomainSpecific","O19","Table_1","The value does not match the expected ratio (Collected/average put on the market last 3 years)","Error",13487565]

{"sheet":"Changelog","index":13,"n_rows":44,"n_cols":7,"rows_kept":44,"cut":false,"hidden":true,"merged":[]}
["Changed by","SheetName","Cell","Change","Version","Date","REMARKS"]
["CDD","Standard macros",null,"Summations: Accept LT and LE","m17","2021-03-29"]
["CDD","Several pages",null,"Hyperlinks to the same sheet have been removed","03m18","2021-04-14"]
["CDD",null,null,"Change macro version v18","03m18","2021-04-14"]
["CDD",null,null,"Change password","03m18","2021-04-14"]
["CDD","Input data tables",null,"Change default sheet protection in input tables: allow selection of locked cells.","03m18","2021-04-14"]
{"$rows_left_out":39}
{"sheet":"Pre-filling parameters","index":14,"n_rows":3,"n_cols":10,"rows_kept":3,"cut":false,"hidden":true,"merged":[]}
["Sheet From","Sheet To","Top Left Cell","Bottom Right Cell","Row Step","Column Step","Confidentiality flag\n(YES/NO)","Replace locked cells\n(YES/NO)","Hide sheet after pasting\n(YES/NO)","Footnote Call-out (number) exists\n(YES/NO)"]
["Table_1 (Prefilling)","Table_1","G8","W19",1,4,"NO","YES","YES","YES"]
["Table_2 (Prefilling)","Table_2","G8","O22",1,4,"NO","YES","YES","YES"]

{"sheet":"Lists","index":15,"n_rows":42,"n_cols":11,"rows_kept":42,"cut":false,"hidden":true,"merged":[[1,9,1,10],[5,9,5,10],[10,9,10,10],[15,9,15,10],[2,5,7,5]]}
["Country label","Country code",null,"Valid flags (obs_status)","Label",null,"Valid flags (obs_conf)","Label",null,"Textual variables","String"]
["Belgium","BE",null,"E","Estimated data",null,null,null,null,"Institutional names"]
["Bulgaria","BG",null,"D","Definition differs, see metadata","checked: in Batteries definition differs is needed because some countries (ICELAND) may provide in table 1 also data coming from industrial batteries, or countries were the collection rate is higher because there are problem with internet sales (free riders)",null,null,null,"Eurostat Text","Statistical Office of the European Union"]
["Czechia","CZ",null,null,null,null,null,null,null,"Directorate Text","Directorate E: Sectoral and regional statistics"]
["Denmark","DK",null,null,null,null,null,null,null,"Unit Text","Unit E-2: Environmental statistics and accounts; sustainable development"]
["Germany","DE",null,null,null,null,null,null,null,"Data collection information"]
{"$rows_left_out":37}
{"sheet":"Locks","index":16,"n_rows":15,"n_cols":8,"rows_kept":15,"cut":false,"hidden":true,"merged":[]}
["SheetName","TopLeftCell","BottomRightCell","RowStep","ColumnStep","LockType","Focus Back To","Content is Mandatory"]
[]
["Table_1","W8","W10",1,4,"formulas","W11","YES"]
["Table_1","W13","W19",3,4,"formulas","W11","YES"]
["Table_1","O8","S10",1,4,"pre-filled formulas","W11","YES"]
["Table_1","O13","S19",3,4,"pre-filled formulas","W11","YES"]
{"$rows_left_out":10}
{"sheet":"NotStandardRules","index":17,"n_rows":2,"n_cols":1,"rows_kept":2,"cut":false,"hidden":true,"merged":[]}
["RuleName"]
["RatioDenominatorIsAverage"]

{"sheet":"CannotBeZero","index":18,"n_rows":11,"n_cols":10,"rows_kept":11,"cut":false,"hidden":true,"merged":[]}
["Severity","SheetName","Top Left Cell","Bottom Right Cell","Row Step","Column Step","Zero Is Valid If Footnote Exists","Footnote Shift From Value",null,"Inserted CR 20200511"]
["Warning","Table_1","O8","W19",1,4,"YES",2]
["Warning","Table_2","G8","O22",1,4,"YES",2]
[null,null,null,null,null,null,null,null,null,"Checked-Cri-OK-however policy to look for old data (if not changed- no error check should be done"]
[]
[]
{"$rows_left_out":6}
{"sheet":"Thresholds","index":19,"n_rows":34,"n_cols":13,"rows_kept":34,"cut":false,"hidden":true,"merged":[]}
["Severity","SheetName","Top Left Cell","Bottom Right Cell","Row Step","Column Step","Lower value","Upper value","Is Valid If Footnote Exists","Footnote Shift From Value","if there is a footnote we accept that the rule is not respected","revised CR 20200511","percentage values in table 2, mandatory, values higher than 100% are no sense and not admitted, since the recovered  material (output fraction) cannot be higher than the input, and the process has to refer to the material treated within calendar year. As the reporting has to cover as of article 3 points 4 and 5, all individual steps of recycling and all corresponding output fractions, this means that any leftover not yet recycled in the calendar year has to be reported for the input and output in the next calendar year,m no stock is admitted "]
["Error","Table_2","G10","O22",3,4,0,100,"NO",2,"Top Left Cell","Lower value formula ","Upper value  formula "]
["Warning","Table_1","O10","W10",999,4,0,100,"YES",2]
[]
["Error","Table_2","G8",null,3,4,"G9",null,"YES",2,"RCY_INP.W160601","RCY_INP>=RCY"]
["Error","Table_2","G11",null,3,4,"G12","G8","YES",2,"RCY_INP.W160601PB","RCY_INP>=RCY","RCY_INP.W160601>=RCY_INP.W160601PB"]
{"$rows_left_out":29}
{"sheet":"IsFormula - cancelled","index":20,"n_rows":4,"n_cols":8,"rows_kept":4,"cut":false,"hidden":true,"merged":[]}
["Severity","Sheet Name","Top Left Cell","Bottom Right Cell","Row Step","Column Step",null,"Verified CR 20200504"]
["Info","Table_1","O8","W10",1,4,null," COL(%)=[COL(T)/(MKT.{Year}+MKT.{Year-1}+MKT.{Year-2})]*3*100 "]
["Info","Table_1","O13","W19",3,4]
["Info","Table_2","G10","O22",3,4]

{"sheet":"Summations","index":21,"n_rows":110,"n_cols":16,"rows_kept":110,"cut":false,"hidden":true,"merged":[[11,5,11,6]]}
["Severity","Sheet Name","List of Cells\n (first block)","First Total Cell (first block)","Last Total Cell\n(Last block)","Row Block Repetition Step","Column Block Repetition Step","Greater or Equal","Valid Tolerance","Only if all data is available","Non compliance Is Valid If Footnote Exists","Footnote Shift From Value","Display text in error",null,null,"Verified CR 20200504"]
["Error","Table_1","O11,O14,O17","O8","W8",999,4,"EQ",0.1,"YES","NO",3,"Summation not consistent: \"Portable batteries and accumulator-Sales\" should be equal to the sum of the \"Sales\" of the other three batteries types",null,null,"M8=M11+M14+M17"]
["Error","Table_1","O11,O14,O17","O8","W8",999,4,"GE",0.1,"NO","NO",3,"Summation not consistent: \"Portable batteries and accumulator-Sales\" should be equal or higher than the sum for the \"Sales\" of the reported batteries types"]
["Error","Table_1","O12,O15,O18","O9","W9",999,4,"EQ",0.1,"YES","NO",3,"Summation not consistent: \"Portable batteries and accumulator-Collection\" should be equal to the sum of the \"Collection\" of the other three batteries types"]
["Error","Table_1","O12,O15,O18","O9","W9",999,4,"GE",0.1,"NO","NO",3,"Summation not consistent: \"Portable batteries and accumulator-Collection\" should be equal or higher than the sum for the  \"Collection\" of the reported batteries types"]
["Error","Table_2","G9","G8","O20",3,4,"GE",0,"YES","NO",3,"Mass input must be higher than mass output"]
{"$rows_left_out":105}
{"sheet":"SimpleRatios","index":22,"n_rows":6,"n_cols":17,"rows_kept":6,"cut":false,"hidden":true,"merged":[[5,6,5,7]]}
["Severity","Sheet Name","Numerator\n (first block)","Denominator (first block)","First result\n(First block)","Last result\n(Last block)","Row Block Repetition Step","Column Block Repetition Step","Numerator multiplied by ","Ratio Greater or Equal than result cell","Valid Tolerance","If denominator = 0","Display text in error","Accept error If Footnote Exists","Column shift from value to footnote",null,"Changed 20200527"]
["Error","Table_2","G9","G8","G10","O22",3,4,100,"EQ",0.1,"ZERO","Zero denominator error: the rate is calculated as output mass divided by the input mass","YES",3]
[]
[]
[]
[null,null,null,null,null,null,"Must be > 0 for a not relevant dimension. Else you get an infinite loop"]
{"$rows_left_out":1}
{"sheet":"Mandatory","index":23,"n_rows":15,"n_cols":10,"rows_kept":15,"cut":false,"hidden":true,"merged":[]}
["Severity","SheetName","Top Left Cell","Bottom Right Cell","Row Step","Column Step","Empty Is Valid If Footnote Exists","Footnote Shift From Value",null,"Verified CR 20200504"]
["Error","GETTING STARTED","E9","E10",1,999,"NO",999,"STANDARD FOR ALL QUESTIONNAIRES"]
["Error","GETTING STARTED","D14","D22",2,999,"NO",999]
["Error","Table_1","O8","W9",1,4,"YES",2]
["Error","Table_2","G8","O9",1,4,"YES",2]
["Error","Table_2","G11","O12",1,4,"YES",2]
{"$rows_left_out":10}
{"sheet":"MustNotBeNegative","index":24,"n_rows":3,"n_cols":8,"rows_kept":3,"cut":false,"hidden":true,"merged":[]}
["Severity","SheetName","TopLeftCell","BottomRightCell","RowStep","ColumnStep",null,"Verified CR 20200504"]
["Error","Table_1","O8","W19",1,4]
["Error","Table_2","G8","O22",1,4]

{"sheet":"FoototeContent","index":25,"n_rows":3,"n_cols":8,"rows_kept":3,"cut":false,"hidden":true,"merged":[]}
["SheetName","TopLeftCell","BottomRightCell","RowStep","ColumnStep","DistanceFromReferenceToText",null,"Verified CR 20200504"]
["Table_1","Q8","Y19",1,4,1]
["Table_2","I8","Q22",1,4,1]

{"sheet":"IsNumeric","index":26,"n_rows":3,"n_cols":6,"rows_kept":3,"cut":false,"hidden":true,"merged":[]}
["Severity","SheetName","TopLeftCell","BottomRightCell","RowStep","ColumnStep"]
["Error","Table_1","O8","W19",1,4]
["Error","Table_2","G8","O22",1,4]